age,gender,race,death,Time_from_COVID_positive_to_death_in_days,ventilator,albumin,diastolicBP,systolicBP,cr,ddimer,egfr,eosinophil,ferritin,fibrinogen,hgb,inr,lymphocyte,neutrophil,NLratio,platelet,protein,pulse,pulseOx,rr,temperature,wbc,alt,ast,bun,calcium,chloride,crp,interleukin6,ldh,mcv,monocyte,mpv,procalcitonin,rdw,tnf,troponin,ptt,bmi,glucose,direct_bili,total_bili,indirect_bili,creatine_kinase,pro_bnp,potassium,charlson_score,ct_value
89+,F,Black,1,0.877083333,0,3.9,70,128,2.43,1.63,22,0,817,,12.6,1.9,4.3,6.8,1.581395349,149,7.4,106,83,32,98.3,11.7,18,0.1999,73,8.2,0.1999,0.1999,0.1999,,101,0.6,11.6,,14.6,,0.18,33.5,25.64,184,0.1999,0.3,0.1001,923,,,5,
89+,F,Black,1,9.761805556,0,3.5,97,124,1.99,,28,0.1,,,8.1,,2.2,7.5,3.409090909,391,6.9,83,96,18,97.6,11,12,0.4,32,9.1,0.4,0.4,0.4,,99.3,0.9,9.9,,14.3,,0.03,,25.52,230,0.4,1,0.6,121,572,5.4,6,34
89+,F,Other,0,,0,3.8,61,126,2.6,0.26999,21,0,512,283,13,1.2,0.8,7.9,9.875,84,8.1,96,100,26,99.6,9.2,25,0.1999,99,9.1,0.1999,0.1999,0.1999,386,98.6,0.5,14.7,0.3,13.9,,0.03,29.4,15.14,102,0.1999,0.5,0.3001,532,1363,4.7,0,
89+,F,Black,0,,0,3.6,56,113,1.4,2.02,42,0,367,535,13.8,1.3,1.7,10.1,5.941176471,181,7.4,78,96,20,97.5,13.2,9.999,0.2,65,10.7,0.2,0.2,0.2,260,103.1,1,12.6,,13.7,,0.02,31.2,19.19,206,0.2,0.4,0.2,100,1982,4.4,5,
89+,M,Other,0,,0,3.7,62,114,1.79,1.99,43,0,255,,8.4,1.1,0.4,7.8,19.5,261,7.2,79,97,19,97,8.8,21,0.1999,42,8.5,0.1999,0.1999,0.1999,187,94.1,0.5,10,,16.2,,,43.1,18.78,237,0.1999,0.2,0.0001,,,5.4,5,
89+,M,Black,0,,0,3.7,63,108,2.56,0.49,28,0,689,1246,15,1.2,1,11.5,11.5,407,8.5,92,95,18,95.8,13.2,20,0.1999,142,10.4,0.1999,0.1999,0.1999,363,93.4,0.4,12.8,,16.4,,0.05,33,,246,0.1999,0.4,0.2001,226,,5,4,
89+,F,Other,1,4.333333333,0,3.4,0,0,1.2,6.21,41,0,491,502,11.7,2,1.7,13.7,8.058823529,325,7.2,106,97,20,97.5,16.2,21,0.1999,34,9.7,0.1999,0.1999,0.1999,506,88.3,0.6,10,0.1,14,,0.3,35.8,25.68,,0.1999,0.3,0.1001,,3945,3.6,4,
89+,F,Black,1,0.573611111,0,3.6,68,162,2.74,,19,0.1,1717,1071,15.3,,1.9,9,4.736842105,120,7.2,118,96,32,98.4,11.2,25,0.1999,77,9.8,0.1999,0.1999,0.1999,,86.9,0.2,13.2,38.2,14.5,,0.08,,27.82,415,0.1999,0.3,0.1001,1623,,4.7,1,
89+,F,Black,0,,0,4,78,127,4.9,,10,0,,,13.1,,1.5,22.3,14.86666667,464,8.9,95,98,16,98.2,25.6,106,0.4,174,10,0.4,0.4,0.4,,97.5,1.4,11.8,0.3,13.6,,0.04,,26.47,173,0.4,0.9,0.5,,,4.7,3,38.2
89+,F,Declined,0,,0,,75,145,0.7,,93,0,,,15,,0.6,6.9,11.5,160,,79,96,16,97.5,8.2,,,44,8.9,,,,,101.2,0.6,11.6,,14.6,,,,15.74,,,,0,,,4.4,2,
89+,M,White,0,,0,3.5,62,108,0.8,1.16,108,0,124,382,14.2,1,0.7,5.3,7.571428571,179,6.3,74,99,18,98,6.5,9.999,0.3,28,9.1,0.3,0.3,0.3,182,96.6,0.5,12.6,0.0999,15.1,,0.01,31.9,20.88,96,0.3,0.7,0.4,35,230,4.9,0,33.4
89+,F,Black,1,9.375,2,3.9,34,70,0.75,,72,0,,,14.5,1,1.3,6.9,5.307692308,154,7.1,136,76,28,100.8,8.8,37,0.3,11,8.5,0.3,0.3,0.3,592,91.7,0.5,10.4,,13.7,,0.01,29.9,25.58,243,0.3,0.5,0.2,1007,,3.8,6,21.5
89+,F,Other,1,5.282638889,0,3.3,57,117,1.5,2.31,32,0,472,607,10,1.1,0.3,3.6,12,183,5.9,69,99,20,99.9,4.2,15,0.1999,52,8.2,0.1999,0.1999,0.1999,357,96.5,0.3,10.5,0.3,13.1,,0.03,28.7,27.84,180,0.1999,0.3,0.1001,504,2505,5.2,5,
89+,F,Black,1,10.87222222,1,3.6,34,77,1.1,9.45,46,0,,,15.3,1.1,1.1,4.1,3.727272727,130,6.4,71,91,16,100.2,5.7,37,0.3,15,8.2,0.3,0.3,0.3,,92.5,0.5,11.7,,13.2,,0.01,33,37.93,212,0.3,0.6,0.3,299,925,4,7,
89+,F,Black,0,,0,3.4,69,114,1,1.48,62,0,283,554,11.7,1.1,1.3,7.7,5.923076923,249,7.5,83,96,16,96.7,9.7,19,0.1999,36,9,0.1999,0.1999,0.1999,262,90.2,0.5,11.7,0.0999,14,,0.02,33.2,16.69,192,0.1999,0.3,0.1001,67,481,4.1,2,
89+,F,Other,0,,0,3.1,73,141,1.3,13.27,38,0,395,515,12.1,1.3,1.7,4.2,2.470588235,187,6.2,78,97,16,100.1,6.1,35,0.1999,33,8.4,0.1999,0.1999,0.1999,402,100,0.2,11.5,,13.2,,0.01,31.6,27.34,105,0.1999,0.2,0.0001,,,4.4,2,
89+,M,Other,0,,0,4.4,55,124,2.5,2.68,24,0,114,356,13.3,1.4,0.6,14.6,24.33333333,400,7.5,80,92,16,97.6,15.8,10,0.2,48,10.2,0.2,0.2,0.2,546,91.9,0.5,10.5,43.4,17.2,,0.07,37.5,15.82,226,0.2,0.4,0.2,95,15000.001,4.2,4,
89+,M,Other,1,12.05138889,0,1.9999,35,67,1.2,,68,0,,,8,2.5,0.7,4,5.714285714,99,2.3,120,90,24,100.8,4.8,9.999,0.1999,26,3.5,0.1999,0.1999,0.1999,,98.9,0.1,10.5,,14.4,,0.02,200.0001,19.68,32,0.1999,0.1,-0.0999,81,897,2.3,5,32.6
89+,F,Other,0,,0,4.1,42,126,3.41,1.38,12,0,423,,12.2,1.3,2.2,18.1,8.227272727,293,7.4,139,86,28,98,21.7,31,0.2,139,10.3,0.2,0.2,0.2,327,104.4,1.5,11,0.2,14.9,,0.32,34,,199,0.2,0.7,0.5,522,6384,6,1,35.5
89+,M,Other,0,,0,4.2,78,103,1.1,5.52,62,0,817,,15.5,1,0.6,4.2,7,105,7.4,91,97,25,100.8,5.4,42,0.1999,20,9.3,0.1999,0.1999,0.1999,322,97,0.6,13.2,,14,,0.01,,18.42,129,0.1999,0.4,0.2001,2933,,4.3,1,
89+,M,Other,1,0.439583333,0,,63,100,,,,,,,,,,,,,,116,86,30,98.4,,,,,,,,,,,,,,,,,,23.3,,,,0,,,,5,
89+,F,Black,0,,0,3.8,54,107,1.49,,32,0,,,12.6,1.2,1.4,5.8,4.142857143,251,8.1,105,96,19,101.1,7.7,16,0.2,45,9.9,0.2,0.2,0.2,345,88.5,0.5,11.8,,16,,0.04,,,104,0.2,0.3,0.1,94,,4.1,0,
89+,F,Black,1,2.704861111,2,,19,78,1.75,,33,0,,,10.8,1.1,1,9.7,9.7,344,,105,77,30,100,11.3,,,59,9.1,,,,,86.2,0.5,12.1,,15.9,,0.07,38.3,33.05,176,,,0,144,5268,4.8,4,
89+,M,Declined,0,,0,2.6,69,104,2.23,,33,0,,,13.4,1.1,0.6,4.2,7,92,5.9,75,91,16,97.9,5.3,32,0.2,32,8.7,0.2,0.2,0.2,,87.1,0.6,12.7,,14.7,,0.28,31.7,21.32,96,0.2,0.4,0.2,792,15000.001,4.9,4,
89+,M,Declined,1,3.884722222,2,4.1,82,160,1.2,,68,0,,,14.8,1.8,0.8,3.9,4.875,92,7.2,106,92,18,97.6,5.4,17,0.8,17,8.1,0.8,0.8,0.8,,91.7,0.7,11,,14.6,,0.03,52.8,21.29,113,0.8,1.8,1,190,1972,4.3,3,
89+,F,White,0,,0,3,82,113,2.32,20.00001,19,0,21961,214,13.6,8.7,1.8,13.8,7.666666667,104,6.7,65,90,18,95.7,17.7,93,0.3,83,8.8,0.3,0.3,0.3,531,95.1,1.9,13.4,,15.3,,0.05,54.8,18.7,,0.3,0.7,0.4,600,1177,4.6,2,
89+,F,Other,1,19.48263889,0,3.8,110,151,1.2,2.61,42,0.2,664,723,14.1,1,1.5,6.3,4.2,436,9.1,89,96,16,97.6,8.4,31,0.2,33,9.9,0.2,0.2,0.2,370,86.7,0.5,10.6,10.5,14.3,,0.00999,35.4,,155,0.2,0.6,0.4,48,,4.7,0,
89+,F,Black,0,,0,3.6,64,112,1.17,,43,0,,,12.9,1,1.4,4.5,3.214285714,163,7.7,104,95,18,98.3,6.7,91,0.2,32,9.4,0.2,0.2,0.2,,98.9,0.7,12.5,,14,,0.04,32.4,30.23,113,0.2,0.5,0.3,211,394,4.5,2,28.1
89+,F,Asian,1,1.974305556,0,2.9,32,89,1.38,,36,0,,,13.1,1.1,1.2,5.7,4.75,155,7.2,114,97,24,102.1,7.4,33,0.2,28,7.8,0.2,0.2,0.2,639,95.4,0.5,12.1,,15.2,,0.02,42.1,46.07,121,0.2,0.5,0.3,1749,971,4.3,2,
89+,F,Black,0,,0,3.1,60,110,0.78,20.00001,83,0,826,580,13.3,1.1,0.8,8.2,10.25,105,6.1,116,93,20,97.6,9.5,38,0.2,27,8.2,0.2,0.2,0.2,503,74,0.5,,0.4,14.4,,0.24,35.1,18.75,149,0.2,0.6,0.4,937,1447,3.9,0,
89+,F,Other,0,,0,3,50,118,0.8,3.99,81,0.1,143,188,13.5,1.3,0.7,4.2,6,152,6.3,116,96,18,98.4,5.8,13,0.5,8,8.4,0.5,0.5,0.5,312,91.9,0.7,10.6,,16.5,,0.01,33.6,28.88,118,0.5,1.5,1,115,1028,4.7,5,
89+,F,Black,1,6.535416667,0,3.1,33,87,5,3.51,8,0.1,651,445,6.8,1.2,1.3,11.4,8.769230769,309,7.1,87,97,18,100.6,13.9,9.999,0.1999,101,8.1,0.1999,0.1999,0.1999,281,100,0.8,12,0.4,17.7,,0.28,36.3,17.22,96,0.1999,0.3,0.1001,99,4789,4.8,4,
89+,M,Other,1,7.859027778,0,3,58,144,3.24,20.00001,18,0,260,647,12.5,1.3,1.1,13,11.81818182,123,7.7,95,96,34,101,14.9,23,0.1999,83,7.7,0.1999,0.1999,0.1999,1145,81.7,0.5,,,18.7,,1.58,42,24.62,134,0.1999,0.4,0.2001,957,,5.1,5,
89+,F,Other,1,11.12847222,0,3.3,72,152,0.45,2.75,120.001,0,,,10.7,1.3,0.5,7.1,14.2,310,7.1,102,90,24,98,8.3,12,1.1,17,9.1,1.1,1.1,1.1,434,95.5,0.7,11.3,0.2,12.7,,0.01,33.1,24,277,1.1,2.3,1.2,52,5933,4.2,3,35.1
89+,F,Black,0,,0,2,60,100,1,1.14,52,0,397,409,10.7,1.7,1.5,12.3,8.2,227,6.2,115,93,16,97.2,14.5,12,0.1999,16,7.7,0.1999,0.1999,0.1999,449,104,0.6,12.2,2.1,16.4,,0.08,31.7,11.54,200,0.1999,0.3,0.1001,54,1952,5,1,
89+,M,Black,1,10.80416667,0,3.7,46,143,1,,69,0,,,15.3,1.3,1.1,3.9,3.545454545,184,7.6,85,100,20,96.7,5.8,20,0.3,38,10.1,0.3,0.3,0.3,,91.4,0.6,11.4,0.1,14.1,,0.01,172.5,18.15,106,0.3,0.9,0.6,105,,4.3,1,28.2
89+,F,Other,0,,0,4.1,88,127,0.8,,67,0,,,11.9,1.1,1.6,3.8,2.375,219,6.9,76,99,16,97.9,6.2,19,0.2,17,8.1,0.2,0.2,0.2,,99.5,0.7,11.8,0.1,12.6,,0.01,30.4,20.5,129,0.2,0.3,0.1,,,3.8,3,
89+,F,Other,1,5.409027778,0,3.7,47,114,6.4,6.24,7,0,514,702,14.4,1,1.5,5.6,3.733333333,191,7.7,75,83,38,98.7,8.1,12,0.3,62,10.1,0.3,0.3,0.3,393,92.3,0.9,11.7,1,14,,0.04,27.6,21,209,0.3,0.5,0.2,36,1513,4.4,5,
89+,F,White,1,2.536111111,0,3.4,52,98,3.46,,15,0.1,,,8.8,1,0.5,5.1,10.2,137,6.2,101,99,21,102.6,6.1,18,0.2,85,7.9,0.2,0.2,0.2,270,101,0.4,9.8,,13.5,,,,,121,0.2,0.3,0.1,,,4.5,7,17.6
89+,M,Other,1,9.78125,0,4.6,33,77,3.1,,19,0,,,18.7,1,0.3,8.1,27,142,9,131,99,22,98,9.2,29,0.3,62,9.8,0.3,0.3,0.3,495,98.6,0.7,9.9,0.3,14.9,,0.34,35.9,,287,0.3,1.1,0.8,3342,1430,4.3,5,
89+,F,White,0,,0,2.5,74,131,0.6,20.00001,93,0,,220,12.1,1.3,3.6,4.2,1.166666667,302,7,94,100,18,98.7,8.6,21,0.1999,7,8,0.1999,0.1999,0.1999,352,94.7,0.6,9.3,,16.4,,0.01,27.3,23.62,112,0.1999,0.8,0.6001,66,,4.2,1,
89+,F,Other,0,,0,3.8,90,135,1,2.42,62,0,89,293,13.7,1.1,1.2,6.3,5.25,218,7.6,116,98,16,98.4,8.2,10,0.1999,34,9.3,0.1999,0.1999,0.1999,169,105.3,0.7,11.1,0.1,13,,0.01,28.1,9.9,,0.1999,0.7,0.5001,107,,3.5,1,24.7
89+,M,Black,1,5.530555556,1,3.7,72,150,1.97,,39,0,,,12.7,1.5,1,3.2,3.2,85,7.7,72,90,18,98.7,4.4,30,0.1999,50,9.5,0.1999,0.1999,0.1999,,71.8,0.2,,0.5,14.6,,0.04,31,21.13,207,0.1999,0.4,0.2001,322,1527,4.6,5,
89+,F,Black,0,,0,4.4,69,125,1.47,0.78,40,0,513,397,12.1,1.1,1.4,2.2,1.571428571,154,7.7,67,95,16,98.2,4,22,0.1999,34,10,0.1999,0.1999,0.1999,,98.2,0.4,12.7,,14.1,,0.01,30.5,26.57,114,0.1999,0.3,0.1001,183,,4.4,1,
89+,F,Black,1,4.305555556,0,2.6,89,143,2.35,,19,0,,,11,1.6,0.5,5.8,11.6,212,5.7,93,74,24,98.9,6.5,35,0.2,67,8.7,0.2,0.2,0.2,325,101.5,0.1,12.1,3.9,15.8,,0.11,40.6,,,0.2,0.4,0.2,902,,3.6,1,
89+,F,Declined,0,,0,3.1,68,106,0.74,3.31,73,0,770,784,14.6,1,0.6,6.6,11,278,7.6,57,97,22,97.8,7.7,13,0.2,23,8.5,0.2,0.2,0.2,900,84.9,0.4,13.2,,14.8,,0.01,32.9,,,0.2,0.4,0.2,301,784,4,2,
89+,F,White,1,8.515972222,0,2.8,87,133,1.6,6.89,30,0,,,10.4,1.1,1.2,5.8,4.833333333,161,5.5,30,88,12,98.1,7.3,41,0.2,31,8.2,0.2,0.2,0.2,235,103.4,0.3,10.9,0.1,15.6,,0.04,31.4,,122,0.2,0.3,0.1,,15000.001,4.4,1,16.1
89+,F,Black,0,,0,3.5,62,103,1.5,7.47,32,0,2777,,13.4,1,1.5,7.9,5.266666667,174,7.2,76,85,20,98.8,10.2,50,0.3,62,9,0.3,0.3,0.3,,88.3,0.7,11.8,0.3,12.9,,0.12,24.5,24.25,137,0.3,1.5,1.2,2860,15000.001,3.6,1,38.7
89+,F,Declined,0,,0,4.2,80,114,0.92,,69,0,,,12,,0.8,5.1,6.375,66,7.6,72,97,24,98.9,6.3,9.999,0.1999,37,9.1,0.1999,0.1999,0.1999,,98.2,0.4,11.7,,15,,0.01,,22.76,129,0.1999,0.4,0.2001,149,1182,4.8,3,
89+,F,White,0,,0,3.6,84,145,0.94,20.00001,56,0,4288,,14.3,1.2,0.3,15.7,52.33333333,121,7.1,87,99,25,98.7,16.9,335,0.4,52,8.8,0.4,0.4,0.4,,107.8,0.7,11.4,,15.7,,0.06,26.8,22.25,180,0.4,1,0.6,150,,5.4,6,
89+,F,Black,1,1.127777778,0,3.4,69,117,1.67,,29,0,,,10,1.1,1.3,9.6,7.384615385,379,7.3,111,97,17,98,11.6,16,0.1999,58,9.4,0.1999,0.1999,0.1999,580,84.1,0.5,12.4,0.6,16.7,,0.06,22.2,25.05,490,0.1999,0.2,0.0001,195,,5.5,6,26
89+,M,White,0,,0,3.1,60,137,1.5,2.36,44,0.1,109,522,8.5,1.2,1.2,6.5,5.416666667,279,5.8,56,95,16,97.6,8.4,10,0.3,21,8.1,0.3,0.3,0.3,184,87.5,0.5,11.2,,14.2,,0.01,38.1,20.62,201,0.3,1,0.7,33,,3.6,3,
89+,F,White,0,,2,3.4,103,144,3.88,20.00001,11,0,,,14.2,,11.7,20.8,1.777777778,199,7,85,92,14,100.7,35.2,31,0.1999,93,8.3,0.1999,0.1999,0.1999,606,104,1.6,11.6,7.1,14.6,,0.12,,24.8,,0.1999,0.4,0.2001,291,4134,5.1,2,
89+,M,White,0,,0,3.9,53,105,1.77,4.48,36,0,560,,14.7,1,1.1,8.6,7.818181818,237,8,97,94,19,97.4,11,33,0.5,53,10.2,0.5,0.5,0.5,368,91.1,1.3,10.2,,15.1,,0.08,31,24.43,144,0.5,0.9,0.4,50,,3,5,
89+,F,Black,0,,0,,65,154,,1.01,,0.1,,,13.4,1.1,1.1,3.5,3.181818182,355,,65,96,17,98.5,5.2,,0.2,,9.6,0.2,0.2,0.2,,93.3,0.5,11.3,,12.5,,,34.3,32.61,,0.2,0.7,0.5,,,4.8,3,
89+,F,Black,1,1.963888889,1,3.2,88,179,4.14,,12,0,,,10.3,1,0.7,5,7.142857143,215,6.7,60,98,14,95.4,6.5,75,0.1999,66,7.6,0.1999,0.1999,0.1999,,96.7,0.8,12.8,,14,,0.09,37,30.93,365,0.1999,0.2,0.0001,106,15000.001,,7,
89+,F,Black,0,,0,3.6,94,153,1.33,7.52,45,0.4,954,,13.4,1,1.4,10.2,7.285714286,345,7,105,97,16,97.9,13.2,24,0.2,40,9.9,0.2,0.2,0.2,335,73.5,1,9.7,,16.6,,0.05,26.1,27.41,270,0.2,0.4,0.2,127,545,5.3,1,
89+,F,White,1,4.272916667,0,2.5,56,122,0.7,,94,0,1800,,10.1,1.1,1.9,1.7,0.894736842,158,5.4,79,96,22,98.1,3.9,14,0.1999,15,8.6,0.1999,0.1999,0.1999,,126.8,0.3,11.9,,13.5,,0.08,,35.43,105,0.1999,0.2,0.0001,39,15000.001,3.8,2,
89+,M,Black,1,1.784722222,1,3,76,104,2.21,,34,0,,,9.2,1.6,0.8,7,8.75,119,7.2,89,96,8,97.7,8.6,16,0.3,67,9.5,0.3,0.3,0.3,,90.8,0.7,14.3,,14.2,,0.07,37.2,24.96,231,0.3,0.8,0.5,59,15000.001,4.7,4,25.1
89+,M,Other,0,,0,3.4,74,162,1.6,,41,0,,,12.9,1.1,1.2,2.3,1.916666667,132,7,67,94,16,98.4,3.9,9.999,0.2,34,8.6,0.2,0.2,0.2,,99.8,0.4,10.3,,13,,0.02,33.3,25.1,136,0.2,0.6,0.4,53,1144,4.4,5,
89+,F,Other,0,,0,3.9,54,132,1.02,2.29,51,0,1676,882,15.1,1.1,0.8,8.5,10.625,174,7.6,83,80,16,97.6,9.6,67,0.5,47,8.9,0.5,0.5,0.5,411,93,0.3,10.3,,13.2,,0.01,31.5,20.88,240,0.5,1.1,0.6,177,671,5.1,2,
89+,M,Other,0,,0,4,51,137,1.15,,72,0,38,,7.1,1.2,0.3,2.3,7.666666667,128,6.7,92,97,18,98.3,5.5,16,0.1999,21,10,0.1999,0.1999,0.1999,,73.4,2.8,11.2,0.1,19.4,,,45.1,25.82,149,0.1999,0.2,0.0001,,,3.5,0,
89+,M,Other,1,8.797916667,0,2.9,35,50,1.07,2.64,64,0,357,442,13.9,0.9,1.2,7.9,6.583333333,137,6.9,70,90,23,97.5,9.3,21,0.1999,33,7.5,0.1999,0.1999,0.1999,318,94.4,0.1,10.7,4.1,13.3,,0.04,59.9,16.39,115,0.1999,0.3,0.1001,242,2979,3.8,5,14.9
89+,F,Other,0,,0,3.8,76,124,0.79,,82,0,711,,14.5,0.9,0.9,3.1,3.444444444,129,6.5,79,95,16,100.1,4.4,16,0.2,13,8.3,0.2,0.2,0.2,303,92.3,0.4,12.4,,14.6,,0.01,28.2,21.46,105,0.2,0.4,0.2,60,422,4.3,0,22.4
89+,M,Other,0,,0,3.4,59,106,1.6,20.00001,41,0,749,599,13.5,1.3,0.9,14.3,15.88888889,327,8,74,75,24,97.9,16.1,28,0.1999,30,9.3,0.1999,0.1999,0.1999,414,96.1,1,12.2,0.6,14.9,,0.07,44.9,20.12,157,0.1999,0.8,0.6001,153,,4.1,1,
89+,M,Other,1,5.190972222,2,4,66,98,1.1,,62,0.1,,,14.6,1.4,3.1,2.8,0.903225806,141,7.6,93,100,35,97.8,6.7,29,0.1999,21,8.7,0.1999,0.1999,0.1999,,94.6,0.7,12,,13.8,,0.22,38.4,,165,0.1999,0.5,0.3001,388,2745,,1,
89+,F,White,1,3.850694444,0,3.3,44,93,2.06,,22,0,,,8.1,,0.5,8.5,17,117,7,135,89,26,98.5,9.3,53,0.2,33,9.1,0.2,0.2,0.2,674,83.8,0.3,11.4,,17.6,,,,22.77,,0.2,0.6,0.4,1204,,4.3,3,
89+,M,Other,0,,0,2.8,56,143,1.02,1.88,82,0,174,517,9.8,1.2,0.4,9.7,24.25,276,5.5,101,98,23,98.6,10.7,42,0.2,14,9.3,0.2,0.2,0.2,218,87.6,0.5,10.2,,17,,0.05,32.6,,140,0.2,0.3,0.1,133,,4.4,3,
89+,F,Black,1,8.540972222,0,2.9,30,101,1.79,16.73,32,0,549,518,12.7,2,1.2,15.2,12.66666667,75,6,96,99,18,97.7,17.4,17,0.1999,61,10.6,0.1999,0.1999,0.1999,359,93.5,0.7,14.3,0.3,16.6,,0.23,40.7,28.62,651,0.1999,0.2,0.0001,1769,,3.7,4,
89+,M,Asian,1,1.26875,0,,97,181,,0.86,,0,,,17.7,1,2.6,14,5.384615385,290,,108,93,18,97.6,18.2,,0.4,,9.1,0.4,0.4,0.4,,88,1.4,11.1,,12.4,,,28.7,20.24,156,0.4,1.1,0.7,,,4.1,1,
89+,F,Black,0,,0,2.1,77,99,1.34,1.21,45,0,731,747,8.9,1.9,3.6,11.7,3.25,460,6.1,99,100,35,99.9,16,17,0.2,150,8.6,0.2,0.2,0.2,1028,98.4,0.5,12,0.3,16.9,,0.09,33.4,28.32,352,0.2,0.4,0.2,102,3135,3.9,1,
89+,F,White,1,6.260416667,0,3.2,86,147,0.73,1.26,75,0,65,505,9.6,1.1,0.8,6.6,8.25,209,5.9,79,92,20,100.3,8.1,12,0.1999,13,8.2,0.1999,0.1999,0.1999,221,81.9,0.7,10.5,0.1,16.7,,0.01,,26.57,120,0.1999,0.3,0.1001,60,668,4.1,1,
89+,M,White,1,7.568055556,0,3.3,28,57,2.52,1.53,23,0.1,1657,,14.2,1.1,1.2,10.7,8.916666667,375,6.5,80,84,26,99.3,12.3,30,0.3,55,8.5,0.3,0.3,0.3,597,97.9,0.3,10.1,1.1,14,,0.07,,28.19,135,0.3,0.5,0.2,240,7997,4.4,6,
89+,F,Black,1,0.843055556,0,2.7,64,127,3.7,,11,0.7,,,11.8,1.4,1.4,5.2,3.714285714,158,7.9,155,89,40,99.8,7.6,91,0.5,61,10.7,0.5,0.5,0.5,,90.5,0.1,12.7,,16.7,,0.4,28.7,23.61,140,0.5,1,0.5,62,5707,4,6,15.4
89+,F,Other,1,6.330555556,0,3.3,33,77,2.3,20.00001,24,0,375,428,14.6,1.2,1.7,17.6,10.35294118,168,8.6,128,84,38,100.6,20.1,37,0.3,103,10.5,0.3,0.3,0.3,363,91.7,0.6,11.6,0.4,16.3,,0.05,29.8,21.36,193,0.3,0.6,0.3,,3008,4,3,
89+,M,White,0,,0,2.9,68,110,0.8,1.97,90,0,,,10.5,,1.2,1.5,1.25,153,4.8,79,100,20,99,3,13,0.4,11,7.8,0.4,0.4,0.4,423,83.1,0.3,10.5,0.1,17.2,,0.04,,26.24,87,0.4,0.8,0.4,67,,4,5,19.4
89+,F,Black,0,,0,3.4,83,146,1.63,15.2,36,0.1,839,700,12.8,1.1,1.1,12.3,11.18181818,634,6.5,94,98,20,97.6,14.6,19,0.1999,91,9.2,0.1999,0.1999,0.1999,416,86,0.9,10.3,0.4,14.7,,0.08,29.5,20.14,950,0.1999,0.3,0.1001,216,1987,5.1,5,
89+,F,Black,1,3.679166667,0,3.1,67,129,9.28,,4,0,,,13.1,,2.7,13.1,4.851851852,189,6.4,60,86,28,98.5,17.4,47,0.2,81,9.3,0.2,0.2,0.2,,95.8,1.1,11.8,,12.8,,,,20.17,128,0.2,0.4,0.2,,,7.3,3,
89+,F,Other,0,,0,3.6,75,148,3.19,2.04,16,0,530,762,10.6,1.1,1.3,5.1,3.923076923,212,7.2,83,92,16,96.4,7.3,9.999,0.1999,64,9,0.1999,0.1999,0.1999,323,96.2,0.9,10.8,0.5,13.1,,0.07,45.7,29.72,156,0.1999,0.3,0.1001,107,995,5.1,5,
89+,M,Other,0,,0,3.1,67,122,0.9,0.26999,79,0,259,589,12.8,1.2,0.9,6,6.666666667,212,6.4,85,96,20,98.7,8.2,25,0.2,23,8.6,0.2,0.2,0.2,349,93,1.2,10.7,,15.1,,0.01,32.6,,185,0.2,0.4,0.2,705,1383,4.2,2,
89+,M,Other,1,2.51875,1,3.3,12,72,1.85,16.72,42,0,,,11.2,1.2,0.3,10.8,36,136,6.1,101,65,28,98.7,11.8,13,0.2,46,8.2,0.2,0.2,0.2,279,96.3,0.5,12.5,7.6,16.3,,0.02,29.9,23.61,213,0.2,0.3,0.1,130,2342,5.5,4,13.4
89+,F,Other,1,8.913194444,0,3.9,20,86,0.9,1.88,59,0,365,,12.3,1.1,0.7,8.4,12,186,6.8,65,98,18,100.6,9.6,23,0.2,16,9.1,0.2,0.2,0.2,323,85.6,0.4,10.4,,14.3,,0.01,,27.42,147,0.2,0.4,0.2,576,1248,3,0,
89+,F,Other,0,,0,3,84,155,0.7,7.62,78,0,521,,13,1.1,0.6,3.7,6.166666667,277,6.4,52,89,18,98.4,4.7,20,0.1999,14,8.7,0.1999,0.1999,0.1999,371,83.2,0.4,9.4,,17.3,,0.02,,24.14,142,0.1999,0.2,0.0001,117,1775,4.2,3,23.1
89+,M,Declined,0,,0,3,82,140,1.51,20.00001,43,0,361,895,13.9,1.1,1,14.2,14.2,423,8.1,124,90,30,99.8,16.3,25,0.2,34,8.4,0.2,0.2,0.2,,93.2,1,10.9,0.4,14.3,,0.72,27.3,25.15,244,0.2,0.5,0.3,86,3981,5.1,4,
89+,F,Black,1,1.541666667,0,2.8,31,81,8.55,3.89,4,0.1,674,475,7.8,1.1,0.3,7.6,25.33333333,191,5.3,62,100,17,98.3,8.9,9.999,0.1999,128,8,0.1999,0.1999,0.1999,205,77.8,0.8,10,0.2,19.1,,0.1,43,39.11,89,0.1999,0.2,0.0001,57,11382,3.6,6,
89+,F,White,0,,0,4,62,113,1.39,0.54,35,0.1,60,375,10.2,1.3,1.8,9.1,5.055555556,135,6.6,64,95,32,97.7,11.7,10,0.1999,34,9,0.1999,0.1999,0.1999,215,95,0.6,13.3,0.1,15.1,,0.01,34,21.8,136,0.1999,0.3,0.1001,51,5200,4.8,5,
89+,F,White,0,,0,3.3,55,143,0.59,9,95,0,535,,12.5,0.9,0.8,12.7,15.875,302,7,101,92,18,96.7,14,22,0.1999,16,9,0.1999,0.1999,0.1999,521,80.2,0.3,9.6,0.1,15.7,,0.01,,19.74,87,0.1999,0.2,0.0001,45,2534,3.2,1,
89+,F,Other,0,,0,3.8,63,120,0.64,0.44,87,0,582,664,13.9,0.9,1.4,2.1,1.5,173,6.8,89,94,18,99,3.8,18,0.1999,16,8.8,0.1999,0.1999,0.1999,349,90.3,0.3,9.8,,12.8,,0.01,27.3,26.37,113,0.1999,0.3,0.1001,47,522,3.7,0,
89+,M,Other,1,8.252777778,0,2.9,29,61,2.1,3.87,36,0,1457,,11,1.2,1.2,9.9,8.25,231,6.5,69,100,30,100,11.5,61,0.2,53,8.5,0.2,0.2,0.2,629,87.6,0.2,11.4,1.5,13.2,,0.2,,31.24,104,0.2,0.4,0.2,461,1858,4.7,0,
89+,F,Black,1,7.782638889,0,3.2,57,125,6.6,2.65,6,0,,643,11.1,1.4,0.5,3.9,7.8,248,6.9,114,94,24,100,4.9,24,0.7,106,9.3,0.7,0.7,0.7,558,87.6,0.4,10.5,12.4,15.4,,0.36,35.8,20.57,384,0.7,1.1,0.4,2501,3545,4.8,5,
89+,F,White,0,,0,2.9,52,157,0.9,17.33,59,0,562,,13.6,1,1.3,10.6,8.153846154,291,5.9,73,95,14,98.8,14.1,19,0.2,37,9.2,0.2,0.2,0.2,469,89.6,1.7,12.4,0.1,13.8,,0.06,,19.25,161,0.2,0.4,0.2,49,5401,4.2,1,
89+,M,Other,1,1.854861111,0,3.4,65,108,5.2,,10,0,,,11.3,1,1.1,10.3,9.363636364,185,7.3,120,87,19,96.4,12.3,19,0.2,79,8.6,0.2,0.2,0.2,,78.5,0.7,12.2,4.6,14.9,,0.17,30.8,23.41,333,0.2,0.4,0.2,312,,5.1,2,
89+,F,Other,1,8.784722222,0,,36,99,2.6,,17,0,,,13.9,,0.9,8.1,9,161,,73,100,20,100.7,9.3,,,83,8.4,,,,461,99.6,0.1,10.6,,16.5,,0.08,,21.58,171,,,0,280,,4.5,1,
89+,F,Black,0,,0,3.8,70,172,0.6,1.99,113,0.1,1245,515,11.6,1.2,1.3,3.5,2.692307692,258,6.5,77,99,16,97.4,5.6,12,0.5,25,9.7,0.5,0.5,0.5,370,85.5,0.7,10.9,0.1,17.4,,0.04,29.7,18.75,102,0.5,1,0.5,54,1581,4.2,3,
89+,F,Black,1,3.897222222,0,3.9,65,148,2.89,,18,0,2478,888,14.3,,1.2,13,10.83333333,223,7.7,146,100,35,103.2,14.7,26,0.2,51,9.9,0.2,0.2,0.2,,97.3,0.4,13.6,50.0001,13.1,,1.02,,40.47,242,0.2,0.7,0.5,217,15000.001,4.1,6,
89+,F,Black,1,3.555555556,0,3.8,56,132,1,1.75,52,0,261,,13,1.2,0.6,6.8,11.33333333,223,6.6,98,92,22,99.2,8.1,16,0.9,21,8.5,0.9,0.9,0.9,615,81.5,0.7,11.8,0.2,12.4,,0.01,31.4,33.06,171,0.9,1.8,0.9,170,494,3.8,0,
89+,F,Black,1,4.309027778,0,3.8,75,117,1,,52,0,,,13.2,1,1.2,16.9,14.08333333,393,7.2,82,62,38,99,19.2,58,0.3,60,8.9,0.3,0.3,0.3,1168,92.3,0.7,9.8,,14.4,,0.02,,19.11,123,0.3,0.7,0.4,8326,,4.5,4,33.5
89+,F,Black,1,0.647222222,1,3.4,31,64,4.5,20.00001,11,0,,,12.3,1.3,0.8,16,20,241,7.6,84,89,16,102.2,17.6,14,0.3,85,10.4,0.3,0.3,0.3,437,82.3,0.8,13.2,,14.5,,0.48,35.1,23.68,102,0.3,0.5,0.2,243,15000.001,4.3,5,
89+,F,Black,0,,0,,50,159,9.76,4.55,4,0,1703,,12.5,1.1,0.9,8.2,9.111111111,187,,54,97,18,98.3,9.5,,,91,7.7,,,,625,76.2,0.3,10.8,2.8,16.3,,,35.7,27.73,228,,,0,,,5.6,5,
89+,F,Other,1,13.8875,0,3.5,81,153,1.4,,35,0,231,,11.5,1.1,1.5,4.2,2.8,143,7.1,69,84,18,102,6.3,23,0.1999,23,8.3,0.1999,0.1999,0.1999,399,94.2,0.6,10.7,,13.5,,0.01,,28.33,116,0.1999,0.3,0.1001,89,,4.4,5,31.4
89+,F,White,1,2.061805556,0,3.1,38,63,0.74,,89,0.1,,,12.8,1.1,0.7,5.2,7.428571429,198,6.1,93,94,24,95.2,6.3,18,0.1999,27,8.3,0.1999,0.1999,0.1999,331,82.6,0.3,11.3,0.9,14.7,,0.68,,18.23,143,0.1999,0.2,0.0001,248,9589,4.4,4,
89+,F,White,0,,0,3.4,57,123,1.26,20.00001,40,0,1065,608,13.8,1.1,0.8,14.4,18,268,6.8,99,93,20,98,16.7,54,0.1999,66,9.5,0.1999,0.1999,0.1999,382,94.9,0.4,9.6,0.3,15.7,,0.01,31.8,26.16,166,0.1999,0.2,0.0001,19.999,,5.2,1,
89+,F,Black,0,,0,4.1,91,131,1.1,,47,0,,,11.8,1.5,2.7,4.6,1.703703704,263,8.2,89,96,18,99.9,8.1,16,0.2,22,8.8,0.2,0.2,0.2,,86.7,0.7,10.8,,14.8,,0.04,28.9,29.35,116,0.2,0.5,0.3,129,172,4,3,
89+,F,White,1,6.470833333,0,,41,99,0.53,,108,0,,,9.7,1.2,0.3,2,6.666666667,150,,94,90,24,100.8,2.8,,,15,7.7,,,,,94.8,0.4,10.4,,16,,0.01,33.3,18.94,94,,,0,19.999,839,3.4,8,18.1
89+,F,Black,0,,0,4.2,56,155,8.8,0.89,5,0,1988,442,11.8,1.4,1,6.6,6.6,64,7.3,90,99,20,100.3,8.3,21,0.1999,70,8.8,0.1999,0.1999,0.1999,352,92.9,0.7,,3.5,15,,0.26,43.1,22.21,67,0.1999,0.3,0.1001,116,,5.4,7,
89+,F,Other,0,,0,3.3,55,130,1.33,0.79,45,0,178,780,10.2,1.3,0.3,7.4,24.66666667,312,5.8,74,96,20,97.8,8.8,22,0.1999,39,8.2,0.1999,0.1999,0.1999,570,88.9,0.4,11.1,0.1,16,,0.03,33.4,26.53,197,0.1999,0.2,0.0001,38,2527,5.3,4,
89+,M,Declined,1,11.05902778,0,3,33,50,1.58,,41,0,382,,11.8,1.2,0.4,7.6,19,198,6.3,111,85,19,103.8,8.9,28,0.1999,52,7.9,0.1999,0.1999,0.1999,259,85.2,0.6,11.9,,15.4,,0.06,26.7,21.13,96,0.1999,0.2,0.0001,67,,4.2,3,20.1
89+,M,Black,1,17.25,1,3.2,43,137,2.21,,28,0,,,12.6,,0.7,3.5,5,114,5.8,67,96,18,99.5,4.6,11,0.2,34,8,0.2,0.2,0.2,366,78.7,0.4,12.6,,14.4,,0.11,,25.2,137,0.2,0.6,0.4,153,2047,4.3,6,25.5
89+,M,Declined,0,,0,3.3,55,125,1.6,3.3,41,0.3,645,430,12.3,1.1,2.6,4.6,1.769230769,227,6.2,112,97,18,97.3,8.1,29,0.3,26,9,0.3,0.3,0.3,220,100.3,0.6,10.5,,13.2,,0.02,29.6,24.99,213,0.3,0.8,0.5,84,461,4.7,3,37.2
89+,F,Other,1,4.659027778,0,3.3,54,140,1.18,1.12,43,0,385,445,13.8,1.4,0.8,10.6,13.25,190,5.8,100,91,30,97.8,12.3,34,0.6,45,9,0.6,0.6,0.6,629,95.6,0.7,11.9,3,16.3,,0.07,37.5,25.07,,0.6,0.9,0.3,89,,4.9,3,
89+,F,Other,0,,0,3.8,69,131,1.01,20.00001,51,0,521,363,15.3,1.3,1.2,13.6,11.33333333,269,7.3,108,97,20,100.2,16.5,13,0.6,26,9.3,0.6,0.6,0.6,360,99.6,1.5,11.8,0.1,14.7,,0.02,33.3,30.2,204,0.6,1.3,0.7,51,,4,3,
89+,M,Black,0,,0,3.8,75,141,1.02,0.82,83,0,131,612,12.5,1,0.5,15.4,30.8,235,6.1,116,91,20,98.1,17.5,9.999,0.1999,17,9.1,0.1999,0.1999,0.1999,227,94.6,1.3,11,,13.6,,0.01,29.8,16.26,124,0.1999,0.3,0.1001,66,723,5.2,2,
89+,F,Other,0,,0,1.9999,62,148,0.69,,96,0.1,,,7.3,,1.1,7.3,6.636363636,448,6.2,95,91,20,97.7,8.6,9.999,0.1999,18,7.9,0.1999,0.1999,0.1999,244,90.9,0.2,9,0.9,18.8,,0.04,,23.21,80,0.1999,0.2,0.0001,19.999,,3.5,0,24
89+,M,Other,1,7.377083333,0,3.6,90,138,1.2,,69,0,,,13.8,1,1.3,2.5,1.923076923,87,7,99,100,20,100.5,4.1,45,0.2,26,9,0.2,0.2,0.2,513,97.1,0.4,10.9,,13.2,,0.00999,,23.74,,0.2,0.7,0.5,,,4.4,1,
89+,F,Other,0,,0,,63,131,1.34,,37,0,273,,11.8,1,1.1,2.6,2.363636364,223,,101,97,20,98.5,4,,,22,8.9,,,,248,95.3,0.4,10.3,0.0999,14.6,,0.01,29,21.61,90,,,0,99,,4.4,2,27.6